{"text_format":"1","workbook":"xlsx","n_sheets":5,"sheets":["Welcome to PPAQ","PPAQ Worksheet","PPAQ Scoring and Interpretation","PPAQ Domains","Moving Forward"],"not_rendered":{"charts":0,"images":9,"macros":1,"external_links":0,"defined_names":12,"comments":2,"pivot_tables":0},"unopened":[],"bounds":{"document_bytes":16777216,"sheet_cells":100000,"rows_first":2000,"rows_last":500,"rows_between":2000,"halvings":0,"cell_chars":16384,"cell_head_chars":4096},"cells_cut":0,"cells_raw":0,"read":"whole","date_system":"1900"}

{"sheet":"Welcome to PPAQ","index":0,"n_rows":18,"n_cols":3,"rows_kept":18,"cut":false,"hidden":false,"merged":[[0,0,0,1],[0,2,0,12],[1,0,1,12],[3,0,3,12],[2,0,2,12],[4,0,4,12],[5,0,5,12],[12,2,12,12],[13,1,13,12],[17,0,17,9],[17,10,17,12],[6,0,6,12],[7,1,7,12],[8,2,8,12],[9,1,9,12],[10,2,10,12],[11,1,11,12],[16,2,16,12],[14,2,14,12],[15,1,15,12]]}
[null,null,"Primary Care Behavioral Health Provider Adherence Questionnaire (PPAQ) Toolkit"]
["Welcome to the PPAQ Toolkit"]
["The Primary Care Behavioral Health Provider Adherence Questionnaire (PPAQ) is a self-report instrument designed by investigators at the VA Center for Integrated Healthcare to assess how often behavioral health providers report engaging in certain behaviors or actions while providing services in primary care.  In particular, the PPAQ is intended for use by behavioral health providers to assess fidelity to models of primary care-mental health integration health services delivery, such as Primary Care Behavioral Health.\n\n\n"]
["Within this toolkit you will find:\n\n  • The PPAQ Worksheet\n  • PPAQ Scoring and Interpretation Information\n  • PPAQ Domain Interpretation Information \n  • Steps for Moving Forward with your PPAQ Results "]
["Using the PPAQ Toolkit"]
["The key components of the Toolkit are organized into five tabs, described in more detail below.  The Toolkit is designed to be user-friendly; step-by-step instructions for moving through each component of the toolkit are provided throughout.  Users are instructed to begin by completing the PPAQ worksheet, located on the following (second) tab.  They should then proceed through each of the subsequent tabs.\n\n\n"]
["An overview of each tab is provided below"]
[null,"Tab 1: Welcome to the PPAQ Toolkit"]
[null,null,"Provides and overview of Toolkit features and use."]
[null,"Tab 2: The PPAQ Worksheet"]
[null,null,"Provides the self-report form for completing the PPAQ."]
[null,"Tab 3: PPAQ Scoring and Interpretation"]
[null,null,"Provides automatic scoring of the PPAQ worksheet and walks users through interpreting results."]
[null,"Tab 4: PPAQ Domains"]
[null,null,"Provides further interpretive information regarding results in relation to domains of PC-MHI practice"]
[null,"Tab 5: Moving Forward"]
[null,null,"Suggests a process for using the Toolkit results to guide practice improvements"]
["\nIf you would like more background about the research behind the PPAQ, please right click the PowerPoint icon on the right and choose \"presentation object\" then choose \"open\" from the sub-menu.  Otherwise, click on the green arrow to begin the PPAQ Worksheet. Please note if you may need to \"enable editing\" and \"enable macros\" before beginning.Once completed the PPAQ toolkit has been formatted to be easily printed for paper copies\n"]

{"sheet":"PPAQ Worksheet","index":1,"n_rows":56,"n_cols":12,"rows_kept":56,"cut":false,"hidden":false,"merged":[[2,3,2,9],[3,3,3,9],[2,0,2,2],[0,2,0,12],[0,0,0,1],[54,11,54,12],[55,11,55,12],[11,11,11,12],[12,11,12,12],[13,11,13,12],[14,11,14,12],[15,11,15,12],[16,11,16,12],[17,11,17,12],[18,11,18,12],[19,11,19,12],[45,11,45,12],[46,11,46,12],[47,11,47,12],[48,11,48,12],[49,11,49,12],[50,11,50,12],[51,11,51,12],[52,11,52,12],[53,11,53,12],[39,0,39,10],[40,0,40,10],[41,0,41,10],[42,0,42,10],[40,11,40,12],[41,11,41,12],[42,11,42,12],[43,11,43,12],[44,11,44,12],[48,0,48,10],[49,0,49,10],[50,0,50,10],[51,0,51,10],[43,0,43,10],[44,0,44,10],[45,0,45,10],[46,0,46,10],[47,0,47,10],[52,0,52,10],[53,0,53,10],[54,0,54,10],[55,0,55,10],[20,11,20,12],[21,11,21,12],[22,11,22,12],[23,11,23,12],[24,11,24,12],[25,11,25,12],[26,11,26,12],[27,11,27,12],[28,11,28,12],[29,11,29,12],[30,11,30,12],[31,11,31,12],[32,11,32,12],[33,11,33,12],[34,11,34,12],[35,11,35,12],[36,11,36,12],[37,11,37,12],[38,11,38,12],[39,11,39,12],[27,0,27,10],[28,0,28,10],[19,0,19,10],[20,0,20,10],[21,0,21,10],[22,0,22,10],[23,0,23,10],[24,0,24,10],[5,0,5,12],[9,0,9,10],[9,11,9,12],[10,0,10,10],[10,11,10,12],[11,0,11,10],[12,0,12,10],[13,0,13,10],[14,0,14,10],[4,0,4,12],[3,0,3,2],[1,0,1,12],[2,11,2,12],[34,0,34,10],[35,0,35,10],[36,0,36,10],[37,0,37,10],[38,0,38,10],[6,0,7,10],[6,11,7,12],[8,0,8,10],[8,11,8,12],[15,0,15,10],[25,0,25,10],[26,0,26,10],[29,0,29,10],[30,0,30,10],[31,0,31,10],[32,0,32,10],[33,0,33,10],[16,0,16,10],[17,0,17,10],[18,0,18,10]]}
[null,null,"Primary Care Behavioral Health Provider Adherence Questionnaire (PPAQ) Toolkit"]
["PPAQ Worksheet"]
["Provider: ",null,null,null,null,null,null,null,null,null,"Date: ",{"$f":"TODAY()","v":"2017-10-24"}]
["Clinic and Location: "]
["Instructions: For each item below, please indicate the frequency with which you typically engage in the behavior described while providing behavioral health services in primary care. Please do not leave any question blank. Click on the answer box next to each question to open the drop down box. Select your answer based on the PPAQ Response Categories. \n"]
["PPAQ Response Categories: 1=Never  2=Rarely  3=Sometimes  4=Often  5=Always"]
["Question ",null,null,null,null,null,null,null,null,null,null,"Answer"]
[]
["1. During clinical encounters with patients, I see patients for 30 minutes or less."]
["2. I manage patients reporting mild and moderate symptoms in primary care, and I refer those with more severe symptoms to specialty mental health services when possible."]
["3. During patient appointments, I discuss barriers to implementing a plan or adhering to treatment recommendations."]
["4. I accept referrals for patients with common mental health problems (i.e., depression, anxiety, etc.)."]
["5. During clinical encounters with a patient, I implement behavioral and/or cognitive interventions."]
["6. In introducing my role in the clinic to patients, I explain that I want to get an idea of what is and what is not working for the patient and then together develop a plan to help them manage their concerns."]
["7. During clinical encounters with patients, I triage patients to determine if they can be treated in primary care or should be referred to a specialty mental health or a community agency."]
["8. I accept referrals for patients who might benefit from brief, targeted behavioral health interventions for chronic pain."]
["9. I accept referrals for patients who might benefit from brief, targeted behavioral health interventions for adjustment to illness (e.g., diabetes, heart disease, spinal cord injury, TBI, etc.)."]
["10. My progress notes in the shared medical record include focused recommendations for the Primary Care Provider and/or primary care team."]
["11. I meet briefly with primary care staff as a team to provide both a behavioral health perspective and behavioral data."]
["12. My progress notes include focused recommendations for the patient."]
["13. I consult with various members of the primary care team (e.g., pharmacist, dietician) in addition to the Primary Care Provider about behavioral aspects of medical conditions (e.g., medications that cause nightmares.)"]
["14. At follow-up encounters with patients, I inquire about progress on goals or action plans set at the previous appointment."]
["15. I administer one or more brief validated measures (e.g., Patient Health Questionnaire-9, or PHQ-9) for an initial screening of symptoms of interest, or I review these findings if measures were administered by other primary care staff."]
["16. It takes 30 minutes or more for me to complete all documentation following the initial appointment."]
["17. Following patient appointments, I provide feedback to Primary Care Providers (based on their preferred method of communication) within 1 business day of an initial appointment."]
["18. During clinical encounters with patients, I clarify, confirm, and discuss the patient's concerns."]
["19. My progress notes include brief clinical impressions of the patient’s presenting problem(s)."]
["20. During a clinical encounter with a patient, I provide full neuropsychological, cognitive, or personality assessments."]
["21. I see patients for weekly, open-ended therapy."]
["22. In introducing my role in the clinic to patients, I explain that our appointments typically will be 30 minutes or less."]
{"$rows_left_out":27}
{"sheet":"PPAQ Scoring and Interpretation","index":2,"n_rows":63,"n_cols":13,"rows_kept":63,"cut":false,"hidden":false,"merged":[[41,6,41,7],[36,8,38,12],[37,0,37,1],[62,0,62,12],[36,0,36,1],[36,2,36,5],[36,6,36,7],[38,6,38,7],[0,2,0,12],[0,0,0,1],[43,0,43,12],[39,0,39,1],[39,2,39,5],[39,6,39,7],[39,8,41,12],[40,0,40,1],[40,2,40,5],[40,6,40,7],[41,0,41,1],[41,2,41,5],[37,2,37,5],[37,6,37,7],[38,0,38,1],[38,2,38,5],[31,0,31,12],[32,0,32,1],[32,2,32,5],[32,6,32,7],[32,8,32,12],[33,0,33,1],[33,2,33,5],[33,6,33,7],[33,8,35,12],[34,0,34,1],[34,2,34,5],[34,6,34,7],[35,0,35,1],[35,2,35,5],[35,6,35,7],[1,0,1,12],[2,11,2,12],[20,0,20,1],[20,2,20,5],[20,6,20,7],[20,8,20,12],[2,0,2,2],[2,3,2,9],[3,3,3,9],[17,1,17,3],[17,6,17,8],[3,0,3,2],[4,0,4,12],[5,0,5,12],[8,11,9,12],[19,0,19,12],[21,0,21,1],[21,2,21,5],[21,6,21,7],[21,8,23,12],[22,0,22,1],[22,2,22,5],[22,6,22,7],[23,0,23,1],[23,2,23,5],[23,6,23,7],[24,8,26,12],[25,0,25,1],[25,2,25,5],[25,6,25,7],[26,0,26,1],[26,2,26,5],[26,6,26,7],[24,0,24,1],[24,2,24,5],[24,6,24,7],[27,0,27,1],[27,2,27,5],[27,6,27,7],[27,8,29,12],[28,0,28,1],[28,2,28,5],[28,6,28,7],[29,0,29,1],[29,2,29,5],[29,6,29,7]]}
[null,null,"Primary Care Behavioral Health Provider Adherence Questionnaire (PPAQ) Toolkit"]
["Scoring and Interpretation Guide"]
["Provider: ",null,null,{"$f":"IF('PPAQ Worksheet'!D3:J3=\"\",\"\",'PPAQ Worksheet'!D3:J3)","v":""},null,null,null,null,null,null,"Date: ",{"$f":"TODAY()","v":"2017-10-24"}]
["Clinic and Location: ",null,null,{"$f":"IF('PPAQ Worksheet'!D4:J4=\"\",\"\",'PPAQ Worksheet'!D4:J4)","v":""}]
["Overview: The PPAQ items are summed to create two subscales.  The first subscale is for the PPAQ items that measure essential behaviors that are highly consistent with Primary Care Behavioral Health.  Higher scores on this subscale indicate higher fidelity.  The second subscale is for the PPAQ items that measure behaviors that are typically inconsistent with Primary Care Behavioral Health.  Higher scores on this subscale indicate lower fidelity.  "]
["Step 1: Your subscale scores are shown below:"]
["Item #","Value","Item #","Value","Item #","Value","Item #","Value","Item #","Value"]
[1,{"$f":"IF('PPAQ Worksheet'!L9=\"\",\"\",'PPAQ Worksheet'!L9)","v":""},11,{"$f":"IF('PPAQ Worksheet'!L19=\"\",\"\",'PPAQ Worksheet'!L19)","v":""},21,{"$f":"IF('PPAQ Worksheet'!L29=\"\",\"\",'PPAQ Worksheet'!L29)","v":""},31,{"$f":"IF('PPAQ Worksheet'!L39=\"\",\"\",'PPAQ Worksheet'!L39)","v":""},41,{"$f":"IF('PPAQ Worksheet'!L49=\"\",\"\",'PPAQ Worksheet'!L49)","v":""}]
[2,{"$f":"IF('PPAQ Worksheet'!L10=\"\",\"\",'PPAQ Worksheet'!L10)","v":""},12,{"$f":"IF('PPAQ Worksheet'!L20=\"\",\"\",'PPAQ Worksheet'!L20)","v":""},22,{"$f":"IF('PPAQ Worksheet'!L30=\"\",\"\",'PPAQ Worksheet'!L30)","v":""},32,{"$f":"IF('PPAQ Worksheet'!L40=\"\",\"\",'PPAQ Worksheet'!L40)","v":""},42,{"$f":"IF('PPAQ Worksheet'!L50=\"\",\"\",'PPAQ Worksheet'!L50)","v":""},null,"PPAQ Response Categories"]
[3,{"$f":"IF('PPAQ Worksheet'!L11=\"\",\"\",'PPAQ Worksheet'!L11)","v":""},13,{"$f":"IF('PPAQ Worksheet'!L21=\"\",\"\",'PPAQ Worksheet'!L21)","v":""},23,{"$f":"IF('PPAQ Worksheet'!L31=\"\",\"\",'PPAQ Worksheet'!L31)","v":""},33,{"$f":"IF('PPAQ Worksheet'!L41=\"\",\"\",'PPAQ Worksheet'!L41)","v":""},43,{"$f":"IF('PPAQ Worksheet'!L51=\"\",\"\",'PPAQ Worksheet'!L51)","v":""}]
[4,{"$f":"IF('PPAQ Worksheet'!L12=\"\",\"\",'PPAQ Worksheet'!L12)","v":""},14,{"$f":"IF('PPAQ Worksheet'!L22=\"\",\"\",'PPAQ Worksheet'!L22)","v":""},24,{"$f":"IF('PPAQ Worksheet'!L32=\"\",\"\",'PPAQ Worksheet'!L32)","v":""},34,{"$f":"IF('PPAQ Worksheet'!L42=\"\",\"\",'PPAQ Worksheet'!L42)","v":""},44,{"$f":"IF('PPAQ Worksheet'!L52=\"\",\"\",'PPAQ Worksheet'!L52)","v":""},null,1,"Never"]
[5,{"$f":"IF('PPAQ Worksheet'!L13=\"\",\"\",'PPAQ Worksheet'!L13)","v":""},15,{"$f":"IF('PPAQ Worksheet'!L23=\"\",\"\",'PPAQ Worksheet'!L23)","v":""},25,{"$f":"IF('PPAQ Worksheet'!L33=\"\",\"\",'PPAQ Worksheet'!L33)","v":""},35,{"$f":"IF('PPAQ Worksheet'!L43=\"\",\"\",'PPAQ Worksheet'!L43)","v":""},45,{"$f":"IF('PPAQ Worksheet'!L53=\"\",\"\",'PPAQ Worksheet'!L53)","v":""},null,2,"Rarely"]
[6,{"$f":"IF('PPAQ Worksheet'!L14=\"\",\"\",'PPAQ Worksheet'!L14)","v":""},16,{"$f":"IF('PPAQ Worksheet'!L24=\"\",\"\",'PPAQ Worksheet'!L24)","v":""},26,{"$f":"IF('PPAQ Worksheet'!L34=\"\",\"\",'PPAQ Worksheet'!L34)","v":""},36,{"$f":"IF('PPAQ Worksheet'!L44=\"\",\"\",'PPAQ Worksheet'!L44)","v":""},46,{"$f":"IF('PPAQ Worksheet'!L54=\"\",\"\",'PPAQ Worksheet'!L54)","v":""},null,3,"Sometimes"]
[7,{"$f":"IF('PPAQ Worksheet'!L15=\"\",\"\",'PPAQ Worksheet'!L15)","v":""},17,{"$f":"IF('PPAQ Worksheet'!L25=\"\",\"\",'PPAQ Worksheet'!L25)","v":""},27,{"$f":"IF('PPAQ Worksheet'!L35=\"\",\"\",'PPAQ Worksheet'!L35)","v":""},37,{"$f":"IF('PPAQ Worksheet'!L45=\"\",\"\",'PPAQ Worksheet'!L45)","v":""},47,{"$f":"IF('PPAQ Worksheet'!L55=\"\",\"\",'PPAQ Worksheet'!L55)","v":""},null,4,"Often"]
[8,{"$f":"IF('PPAQ Worksheet'!L16=\"\",\"\",'PPAQ Worksheet'!L16)","v":""},18,{"$f":"IF('PPAQ Worksheet'!L26=\"\",\"\",'PPAQ Worksheet'!L26)","v":""},28,{"$f":"IF('PPAQ Worksheet'!L36=\"\",\"\",'PPAQ Worksheet'!L36)","v":""},38,{"$f":"IF('PPAQ Worksheet'!L46=\"\",\"\",'PPAQ Worksheet'!L46)","v":""},48,{"$f":"IF('PPAQ Worksheet'!L56=\"\",\"\",'PPAQ Worksheet'!L56)","v":""},null,5,"Always"]
[9,{"$f":"IF('PPAQ Worksheet'!L17=\"\",\"\",'PPAQ Worksheet'!L17)","v":""},19,{"$f":"IF('PPAQ Worksheet'!L27=\"\",\"\",'PPAQ Worksheet'!L27)","v":""},29,{"$f":"IF('PPAQ Worksheet'!L37=\"\",\"\",'PPAQ Worksheet'!L37)","v":""},39,{"$f":"IF('PPAQ Worksheet'!L47=\"\",\"\",'PPAQ Worksheet'!L47)","v":""},"PPAQ-E",{"$f":"SUM(B8:B17,D8:D12,D14:D16,F9:F10,F12:F14,F16:F17,H8,H10:H13,H15:H17,J8,J12:J15)","v":0}]
[10,{"$f":"IF('PPAQ Worksheet'!L18=\"\",\"\",'PPAQ Worksheet'!L18)","v":""},20,{"$f":"IF('PPAQ Worksheet'!L28=\"\",\"\",'PPAQ Worksheet'!L28)","v":""},30,{"$f":"IF('PPAQ Worksheet'!L38=\"\",\"\",'PPAQ Worksheet'!L38)","v":""},40,{"$f":"IF('PPAQ Worksheet'!L48=\"\",\"\",'PPAQ Worksheet'!L48)","v":""},"PPAQ-I",{"$f":"SUM(D13,D17,F8,F11,F15,H9,H14,J9:J11)","v":0}]
[null,"Subscale Score 1: \nEssential Behaviors\nHigher score desired",null,null,{"$f":"+J16","v":0},"   out of\n/190","Subscale Score 2: Inconsistent Behaviors\nLower score desired",null,null,{"$f":"J17","v":0},"  out of\n/50"]
[]
["Step 2:  Your score for the first subscale (items essential for Primary Care Behavioral Health) is indicated under Provider Score with an arrow (←).  Scores in the green range are in the optimal range of fidelity, with yellow indicating moderate fidelity scores, and red indicating low fidelity scores."]
["Essential Items Possible Score",null,"Reference",null,null,null,"Provider Score ",null,"Interpretation"]
[190,null,"Highest Score ",null,null,null,{"$f":"IF(J16 = 190,\"←\",\"\")","v":""},null,"Your score is in the preferred level of fidelity for essential items. However, even within this range your practices might be improved by modifying any low items noted in Step 4 below.   "]
[null,null,null,null,null,null,{"$f":"IF(AND(J16<190,J16>139),\"←\",\"\")","v":""}]
[139,null,"Top third ",null,null,null,{"$f":"IF(J16 = 139,\"←\",\"\")","v":""}]
[null,null,null,null,null,null,{"$f":"IF(AND(J16<139,J16>114),\"←\",\"\")","v":""},null,"Your score indicates a moderate level of fidelity for essential items.  Although several of your behaviors are in line with good practices, Step 4 will indicate which specific behaviors could be improved."]
[114,null,"Midpoint ",null,null,null,{"$f":"IF(J16 = 114,\"←\",\"\")","v":""}]
[null,null,null,null,null,null,{"$f":"IF(AND(J16<114,J16>88),\"←\",\"\")","v":""}]
[88,null,"Bottom third ",null,null,null,{"$f":"IF(J16 = 88,\"←\",\"\")","v":""},null,"Your score indicates a low level of fidelity for essential items.  Although some of your behaviors are in line with good practices, Step 4 will assist in identifying and prioritizing areas for improvement. "]
[null,null,null,null,null,null,{"$f":"IF(AND(J16<88,J16>38),\"←\",\"\")","v":""}]
[38,null,"Lowest score ",null,null,null,{"$f":"IF(J16 = 38,\"←\",\"\")","v":""}]
{"$rows_left_out":34}
{"sheet":"PPAQ Domains","index":3,"n_rows":32,"n_cols":10,"rows_kept":32,"cut":false,"hidden":false,"merged":[[16,9,17,9],[21,1,21,8],[28,1,28,8],[29,0,33,0],[15,0,19,0],[0,1,0,9],[1,0,1,9],[13,0,13,9],[4,0,4,9],[5,0,5,9],[6,1,6,8],[7,0,12,0],[14,1,14,8],[20,0,20,9],[27,0,27,9],[19,1,19,5],[19,6,19,7],[22,0,26,0]]}
[null,"Primary Care Behavioral Health Provider Adherence Questionnaire (PPAQ) Toolkit"]
["PPAQ Domains"]
[]
[]
["Step 5:  PPAQ items can be grouped into one of four domains of practice.  Below you will find a description of each domain and the PPAQ items that are in each domain.  Items with low fidelity based on your responses appear in red text. Place your mouse over the question number to review item text. Domains with the most low fidelity items can be the starting point for improving your practice.  Links to clinical and educational resources relevant to that domain are provided."]
["Domain 1: Clinical Scope and Interventions"]
["Definition","Items in this domain",null,null,null,null,null,null,null,"Links to Relevant Clinical and Educational Resources"]
["This domain refers to integrated care provider behaviors related to providing clinical services to patients, including the type and nature of interventions utilized."]
[]
[null,"5,","20,","23,","28,","32,","37,","42,","43,"]
[null,null,null,"44,","46,",48]
[]
[]
["Domain 2: Practice and Session Management"]
["Definition","Items in this domain",null,null,null,null,null,null,null,"Links to Relevant Clinical and Educational Resources"]
["This domain refers to integrated care provider behaviors that characterize their overall approach to integrated health care using a population-based model. "]
[null,"1,","2,","3,","6,","7,","10,","12,","14,"]
[null,"15,","16,","18,","19,","21,","22,","24,","25,"]
[null,null,"29,","30,","34,","39,","41,",45]
[]
["Domain 3: Referral Management and Care Continuity"]
["Definition","Items in this domain",null,null,null,null,null,null,null,"Links to Relevant Clinical and Educational Resources"]
["This domain refers to integrated care provider behaviors related to the types of referrals they accept from PCPs, including advice to PCPs about referring to specialty mental health. "]
[]
[null,"4,","8,","9,","27,","35,","36,","38,",40]
[]
[]
["Domain 4: Consultation, Collaboration, and Interprofessional Communication"]
["Definition","Items in this domain",null,null,null,null,null,null,null,"Links to Relevant Clinical and Educational Resources"]
["This domain refers to integrated care provider behaviors related to communicating and collaborating with other members of the primary care team. "]
{"$rows_left_out":3}
{"sheet":"Moving Forward","index":4,"n_rows":55,"n_cols":8,"rows_kept":55,"cut":false,"hidden":false,"merged":[[14,0,14,12],[16,0,16,12],[22,0,22,12],[24,0,24,12],[6,0,6,12],[0,0,0,1],[0,2,0,12],[1,0,1,12],[2,0,2,12],[3,0,3,12],[34,0,34,12],[26,0,26,5],[27,0,27,5],[25,0,25,1],[28,0,28,6],[33,7,33,12],[31,0,31,5],[33,0,33,5],[32,0,32,5],[29,0,29,5],[30,0,30,5],[29,7,29,12],[30,7,30,12],[31,7,31,12],[32,7,32,12],[54,2,56,2],[47,0,47,12],[48,0,49,12],[50,0,50,12],[51,0,51,12],[52,0,52,12],[54,5,56,5],[35,0,35,12],[45,0,45,6],[36,0,36,9],[37,0,37,10],[43,0,43,6],[44,0,44,6],[38,0,38,5],[40,0,40,12],[41,0,41,12],[39,0,39,12],[42,0,42,7]]}
[null,null,"Primary Care Behavioral Health Provider Adherence Questionnaire (PPAQ) Toolkit"]
["Moving Forward with your PPAQ Results"]
["    The following steps are optional but can further assist you in applying the results of the PPAQ Toolkit.  Modifying some behaviors identified in the PPAQ can require more coordination and planning than others, including the support of supervisors or other primary care team members. The process below is one approach to address larger practice change goals."]
["\n"]
[]
[]
["The first step in the process is Prioritizing areas for change.  Based on the item analysis you conducted on tab 2 step 4, select one or two items of low adherence that seem the most feasible to address at this time.  The goal is to start small by identifying just one or two related behaviors to address.  "]
[]
[]
[]
[]
[]
[]
[]
["The second step is to Partner with integrated advocates or peers for assistance. This process can include reaching out to the designated integrated care champion at your facility, a colleague, your supervisor, or other experts who act as coaches and advocates for front line integrated care providers.  Sharing the results of your PPAQ self-assessment is a great way to receive additional support. If there is no one designated in these roles at your facility, consider joining or starting a local or regional peer support network of other integrated care providers.  Collaborating with peers can be an excellent way to share firsthand knowledge regarding integrated care practices.  Also consider requesting consultation from experts at either the VA Center for Integrated Healthcare or the PC-MHI Program Office. Their contact information is available below."]
[]
["The third step is Accessing educational and clinical resources.  Several of these resources were listed in the PPAQ Scoring and Interpretation Guide.  There are additional resources available at the Center for Integrated Healthcare website and PC-MHI Program Office SharePoint that can assist you in meeting your goals for change.  Several additional relevant resources are noted below. "]
[]
[]
[]
[]
[]
["The fourth step is an optional one, but is strongly recommended for more complex goals for change. If larger modifications to your practice are necessary, consider engaging in a structured quality improvement process.  Quality improvement can be as simple as conducting Plan-Do-Study-Act cycles that consist of breaking down a larger goal into several steps.  For practice changes that require inter-professional collaboration with primary care team members, consider if developing a small team of interested individuals can facilitate change.  Either way, you don’t need to be a quality improvement expert to use Plan-Do-Study-Act.  There are links to several resources at the end of this to assist you in this process. "]
[]
["Additional Resources to Assist with Moving Forward"]
["Key Websites:"]
[]
[]
["Online Training Courses:\nUse link to access site and search by course title or ID#"]
[]
{"$rows_left_out":25}