{"text_format":"1","workbook":"xlsx","n_sheets":8,"sheets":["Welcome to PPAQ","PPAQ Baseline","PPAQ Scoring and Interpretation","PPAQ Domains","Moving Forward","PPAQ Follow Up","PPAQ Follow-Up Scoring","PPAQ Score Comparison"],"not_rendered":{"charts":0,"images":9,"macros":1,"external_links":0,"defined_names":18,"comments":4,"pivot_tables":0},"unopened":[],"bounds":{"document_bytes":16777216,"sheet_cells":100000,"rows_first":2000,"rows_last":500,"rows_between":2000,"halvings":0,"cell_chars":16384,"cell_head_chars":4096},"cells_cut":0,"cells_raw":0,"read":"whole","date_system":"1900"}

{"sheet":"Welcome to PPAQ","index":0,"n_rows":25,"n_cols":3,"rows_kept":25,"cut":false,"hidden":false,"merged":[[24,0,24,9],[24,10,24,12],[8,1,8,12],[9,2,9,12],[10,1,10,12],[11,2,11,12],[12,1,12,12],[17,2,17,12],[15,2,15,12],[16,1,16,12],[22,1,22,12],[23,2,23,12],[18,1,18,12],[19,2,19,12],[20,1,20,12],[21,2,21,12],[0,0,0,1],[0,2,0,12],[1,0,1,12],[3,0,3,12],[2,0,2,12],[4,0,4,12],[13,2,13,12],[14,1,14,12],[7,0,7,12],[5,0,6,12]]}
[null,null,"Primary Care Behavioral Health Provider Adherence Questionnaire (PPAQ) Toolkit"]
["Welcome to the PPAQ Toolkit"]
["The Primary Care Behavioral Health Provider Adherence Questionnaire (PPAQ) is a self-report instrument designed by investigators at the VA Center for Integrated Healthcare to assess how often behavioral health providers report engaging in certain behaviors or actions while providing services in primary care.  In particular, the PPAQ is intended for use by behavioral health providers to assess fidelity to models of primary care-mental health integration health services delivery, such as Primary Care Behavioral Health.\n\n\n"]
["Within this toolkit you will find:\n\n  • The PPAQ Worksheets (Baseline and Follow-Up)\n  • PPAQ Scoring and Interpretation Information\n  • PPAQ Domain Interpretation Information \n  • Steps for Moving Forward with your PPAQ Results"]
["Using the PPAQ Toolkit"]
["The key components of the Toolkit are organized into eight tabs, described in more detail below.  The Toolkit is designed to be user-friendly; step-by-step instructions for moving through each component of the toolkit are provided throughout.  Users are instructed to begin by completing the PPAQ worksheet, located on the following (second) tab.  They should then proceed through each of the subsequent tabs up to the Moving Forward tab. Users should return to the toolkit and complete the PPAQ Follow-Up worksheet at a later date.\n\n\n"]
[]
["An overview of each tab is provided below"]
[null,"Tab 1: Welcome to the PPAQ Toolkit"]
[null,null,"Provides and overview of Toolkit features and use."]
{"$rows_left_out":16}
{"sheet":"PPAQ Baseline","index":1,"n_rows":56,"n_cols":12,"rows_kept":56,"cut":false,"hidden":false,"merged":[[4,0,4,12],[3,0,3,2],[1,0,1,12],[2,11,2,12],[34,0,34,10],[35,0,35,10],[36,0,36,10],[37,0,37,10],[38,0,38,10],[6,0,7,10],[6,11,7,12],[8,0,8,10],[8,11,8,12],[15,0,15,10],[25,0,25,10],[26,0,26,10],[29,0,29,10],[30,0,30,10],[31,0,31,10],[32,0,32,10],[33,0,33,10],[16,0,16,10],[17,0,17,10],[18,0,18,10],[19,0,19,10],[20,0,20,10],[21,0,21,10],[22,0,22,10],[23,0,23,10],[24,0,24,10],[5,0,5,12],[9,0,9,10],[9,11,9,12],[10,0,10,10],[10,11,10,12],[11,0,11,10],[12,0,12,10],[13,0,13,10],[14,0,14,10],[54,0,54,10],[55,0,55,10],[20,11,20,12],[21,11,21,12],[22,11,22,12],[23,11,23,12],[24,11,24,12],[25,11,25,12],[26,11,26,12],[27,11,27,12],[28,11,28,12],[29,11,29,12],[30,11,30,12],[31,11,31,12],[32,11,32,12],[33,11,33,12],[34,11,34,12],[35,11,35,12],[36,11,36,12],[37,11,37,12],[38,11,38,12],[39,11,39,12],[27,0,27,10],[28,0,28,10],[53,11,53,12],[39,0,39,10],[40,0,40,10],[41,0,41,10],[42,0,42,10],[40,11,40,12],[41,11,41,12],[42,11,42,12],[43,11,43,12],[44,11,44,12],[48,0,48,10],[49,0,49,10],[50,0,50,10],[51,0,51,10],[43,0,43,10],[44,0,44,10],[45,0,45,10],[46,0,46,10],[47,0,47,10],[52,0,52,10],[53,0,53,10],[2,3,2,9],[3,3,3,9],[2,0,2,2],[0,2,0,12],[0,0,0,1],[54,11,54,12],[55,11,55,12],[11,11,11,12],[12,11,12,12],[13,11,13,12],[14,11,14,12],[15,11,15,12],[16,11,16,12],[17,11,17,12],[18,11,18,12],[19,11,19,12],[45,11,45,12],[46,11,46,12],[47,11,47,12],[48,11,48,12],[49,11,49,12],[50,11,50,12],[51,11,51,12],[52,11,52,12]]}
[null,null,"Primary Care Behavioral Health Provider Adherence Questionnaire (PPAQ) Toolkit"]
["PPAQ Baseline Worksheet"]
["Provider: ",null,null,null,null,null,null,null,null,null,"Date: "]
["Clinic and Location: "]
["Instructions: For each item below, please indicate the frequency with which you typically engage in the behavior described while providing behavioral health services in primary care. Please do not leave any question blank. Click on the answer box next to each question to open the drop down box. Select your answer based on the PPAQ Response Categories. \n"]
["PPAQ Response Categories: 1=Never  2=Rarely  3=Sometimes  4=Often  5=Always"]
["Question ",null,null,null,null,null,null,null,null,null,null,"Answer"]
[]
["1. During clinical encounters with patients, I see patients for 30 minutes or less."]
["2. I manage patients reporting mild and moderate symptoms in primary care, and I refer those with more severe symptoms to specialty mental health services when possible."]
{"$rows_left_out":47}
{"sheet":"PPAQ Scoring and Interpretation","index":2,"n_rows":63,"n_cols":13,"rows_kept":63,"cut":false,"hidden":false,"merged":[[27,0,27,1],[27,2,27,5],[27,6,27,7],[27,8,29,12],[28,0,28,1],[28,2,28,5],[28,6,28,7],[29,0,29,1],[29,2,29,5],[29,6,29,7],[24,8,26,12],[25,0,25,1],[25,2,25,5],[25,6,25,7],[26,0,26,1],[26,2,26,5],[26,6,26,7],[24,0,24,1],[24,2,24,5],[24,6,24,7],[21,0,21,1],[21,2,21,5],[21,6,21,7],[21,8,23,12],[22,0,22,1],[22,2,22,5],[22,6,22,7],[23,0,23,1],[23,2,23,5],[23,6,23,7],[1,0,1,12],[2,11,2,12],[20,0,20,1],[20,2,20,5],[20,6,20,7],[20,8,20,12],[2,0,2,2],[2,3,2,9],[3,3,3,9],[17,1,17,3],[17,6,17,8],[3,0,3,2],[4,0,4,12],[5,0,5,12],[8,11,9,12],[19,0,19,12],[33,0,33,1],[33,2,33,5],[33,6,33,7],[33,8,35,12],[34,0,34,1],[34,2,34,5],[34,6,34,7],[35,0,35,1],[35,2,35,5],[35,6,35,7],[31,0,31,12],[32,0,32,1],[32,2,32,5],[32,6,32,7],[32,8,32,12],[0,2,0,12],[0,0,0,1],[43,0,43,12],[39,0,39,1],[39,2,39,5],[39,6,39,7],[39,8,41,12],[40,0,40,1],[40,2,40,5],[40,6,40,7],[41,0,41,1],[41,2,41,5],[37,2,37,5],[37,6,37,7],[38,0,38,1],[38,2,38,5],[41,6,41,7],[36,8,38,12],[37,0,37,1],[62,0,62,12],[36,0,36,1],[36,2,36,5],[36,6,36,7],[38,6,38,7]]}
[null,null,"Primary Care Behavioral Health Provider Adherence Questionnaire (PPAQ) Toolkit"]
["Scoring and Interpretation Guide"]
["Provider: ",null,null,{"$f":"IF('PPAQ Baseline'!D3:J3=\"\",\"\",'PPAQ Baseline'!D3:J3)","v":""},null,null,null,null,null,null,"Date: ",{"$f":"IF('PPAQ Baseline'!L3:M3=\"\",\"\",'PPAQ Baseline'!L3:M3)","v":""}]
["Clinic and Location: ",null,null,{"$f":"IF('PPAQ Baseline'!D4:J4=\"\",\"\",'PPAQ Baseline'!D4:J4)","v":""}]
["Overview: The PPAQ items are summed to create two subscales.  The first subscale is for the PPAQ items that measure essential behaviors that are highly consistent with Primary Care Behavioral Health.  Higher scores on this subscale indicate higher fidelity.  The second subscale is for the PPAQ items that measure behaviors that are typically inconsistent with Primary Care Behavioral Health.  Higher scores on this subscale indicate lower fidelity.  "]
["Step 1: Your subscale scores are shown below:"]
["Item #","Value","Item #","Value","Item #","Value","Item #","Value","Item #","Value"]
[1,{"$f":"IF('PPAQ Baseline'!L9=\"\",\"\",'PPAQ Baseline'!L9)","v":""},11,{"$f":"IF('PPAQ Baseline'!L19=\"\",\"\",'PPAQ Baseline'!L19)","v":""},21,{"$f":"IF('PPAQ Baseline'!L29=\"\",\"\",'PPAQ Baseline'!L29)","v":""},31,{"$f":"IF('PPAQ Baseline'!L39=\"\",\"\",'PPAQ Baseline'!L39)","v":""},41,{"$f":"IF('PPAQ Baseline'!L49=\"\",\"\",'PPAQ Baseline'!L49)","v":""}]
[2,{"$f":"IF('PPAQ Baseline'!L10=\"\",\"\",'PPAQ Baseline'!L10)","v":""},12,{"$f":"IF('PPAQ Baseline'!L20=\"\",\"\",'PPAQ Baseline'!L20)","v":""},22,{"$f":"IF('PPAQ Baseline'!L30=\"\",\"\",'PPAQ Baseline'!L30)","v":""},32,{"$f":"IF('PPAQ Baseline'!L40=\"\",\"\",'PPAQ Baseline'!L40)","v":""},42,{"$f":"IF('PPAQ Baseline'!L50=\"\",\"\",'PPAQ Baseline'!L50)","v":""},null,"PPAQ Response Categories"]
[3,{"$f":"IF('PPAQ Baseline'!L11=\"\",\"\",'PPAQ Baseline'!L11)","v":""},13,{"$f":"IF('PPAQ Baseline'!L21=\"\",\"\",'PPAQ Baseline'!L21)","v":""},23,{"$f":"IF('PPAQ Baseline'!L31=\"\",\"\",'PPAQ Baseline'!L31)","v":""},33,{"$f":"IF('PPAQ Baseline'!L41=\"\",\"\",'PPAQ Baseline'!L41)","v":""},43,{"$f":"IF('PPAQ Baseline'!L51=\"\",\"\",'PPAQ Baseline'!L51)","v":""}]
{"$rows_left_out":54}
{"sheet":"PPAQ Domains","index":3,"n_rows":32,"n_cols":10,"rows_kept":32,"cut":false,"hidden":false,"merged":[[16,9,17,9],[21,1,21,8],[28,1,28,8],[29,0,33,0],[15,0,19,0],[0,1,0,9],[1,0,1,9],[13,0,13,9],[4,0,4,9],[5,0,5,9],[6,1,6,8],[7,0,12,0],[14,1,14,8],[20,0,20,9],[27,0,27,9],[19,1,19,5],[19,6,19,7],[22,0,26,0]]}
[null,"Primary Care Behavioral Health Provider Adherence Questionnaire (PPAQ) Toolkit"]
["PPAQ Domains"]
[]
[]
["Step 5:  PPAQ items can be grouped into one of four domains of practice.  Below you will find a description of each domain and the PPAQ items that are in each domain.  Items with low fidelity based on your responses appear in red text. Place your mouse over the question number to review item text. Domains with the most low fidelity items can be the starting point for improving your practice.  Links to clinical and educational resources relevant to that domain are provided."]
["Domain 1: Clinical Scope and Interventions"]
["Definition","Items in this domain",null,null,null,null,null,null,null,"Links to Relevant Clinical and Educational Resources"]
["This domain refers to integrated care provider behaviors related to providing clinical services to patients, including the type and nature of interventions utilized."]
[]
[null,"5,","20,","23,","28,","32,","37,","42,","43,"]
{"$rows_left_out":23}
{"sheet":"Moving Forward","index":4,"n_rows":43,"n_cols":3,"rows_kept":43,"cut":false,"hidden":false,"merged":[[35,0,35,6],[33,0,33,6],[34,0,34,6],[27,0,27,5],[29,0,29,12],[31,0,31,12],[28,0,28,12],[32,0,32,7],[30,0,30,12],[44,2,46,2],[37,0,37,12],[38,0,39,12],[40,0,40,12],[41,0,41,12],[42,0,42,12],[44,5,46,5],[26,0,26,5],[25,0,25,1],[0,0,0,1],[0,2,0,12],[1,0,1,12],[2,0,2,12],[3,0,3,12],[14,0,14,12],[16,0,16,12],[22,0,22,12],[24,0,24,12],[6,0,6,12]]}
[null,null,"Primary Care Behavioral Health Provider Adherence Questionnaire (PPAQ) Toolkit"]
["Moving Forward with your PPAQ Results"]
["    The following steps are optional but can further assist you in applying the results of the PPAQ Toolkit.  Modifying some behaviors identified in the PPAQ can require more coordination and planning than others, including the support of supervisors or other primary care team members. The process below is one approach to address larger practice change goals."]
["\n"]
[]
[]
["The first step in the process is Prioritizing areas for change.  Based on the item analysis you conducted on tab 2 step 4, select one or two items of low adherence that seem the most feasible to address at this time.  The goal is to start small by identifying just one or two related behaviors to address.  "]
[]
[]
[]
{"$rows_left_out":34}
{"sheet":"PPAQ Follow Up","index":5,"n_rows":56,"n_cols":12,"rows_kept":56,"cut":false,"hidden":false,"merged":[[3,0,3,2],[3,3,3,9],[4,0,4,12],[5,0,5,12],[6,0,7,10],[6,11,7,12],[0,0,0,1],[0,2,0,12],[1,0,1,12],[2,0,2,2],[2,3,2,9],[2,11,2,12],[11,0,11,10],[11,11,11,12],[12,0,12,10],[12,11,12,12],[13,0,13,10],[13,11,13,12],[8,0,8,10],[8,11,8,12],[9,0,9,10],[9,11,9,12],[10,0,10,10],[10,11,10,12],[17,0,17,10],[17,11,17,12],[18,0,18,10],[18,11,18,12],[19,0,19,10],[19,11,19,12],[14,0,14,10],[14,11,14,12],[15,0,15,10],[15,11,15,12],[16,0,16,10],[16,11,16,12],[23,0,23,10],[23,11,23,12],[24,0,24,10],[24,11,24,12],[25,0,25,10],[25,11,25,12],[20,0,20,10],[20,11,20,12],[21,0,21,10],[21,11,21,12],[22,0,22,10],[22,11,22,12],[29,0,29,10],[29,11,29,12],[30,0,30,10],[30,11,30,12],[31,0,31,10],[31,11,31,12],[26,0,26,10],[26,11,26,12],[27,0,27,10],[27,11,27,12],[28,0,28,10],[28,11,28,12],[35,0,35,10],[35,11,35,12],[36,0,36,10],[36,11,36,12],[37,0,37,10],[37,11,37,12],[32,0,32,10],[32,11,32,12],[33,0,33,10],[33,11,33,12],[34,0,34,10],[34,11,34,12],[41,0,41,10],[41,11,41,12],[42,0,42,10],[42,11,42,12],[43,0,43,10],[43,11,43,12],[38,0,38,10],[38,11,38,12],[39,0,39,10],[39,11,39,12],[40,0,40,10],[40,11,40,12],[47,0,47,10],[47,11,47,12],[48,0,48,10],[48,11,48,12],[49,0,49,10],[49,11,49,12],[44,0,44,10],[44,11,44,12],[45,0,45,10],[45,11,45,12],[46,0,46,10],[46,11,46,12],[53,0,53,10],[53,11,53,12],[54,0,54,10],[54,11,54,12],[55,0,55,10],[55,11,55,12],[50,0,50,10],[50,11,50,12],[51,0,51,10],[51,11,51,12],[52,0,52,10],[52,11,52,12]]}
[null,null,"Primary Care Behavioral Health Provider Adherence Questionnaire (PPAQ) Toolkit"]
["PPAQ Follow-Up Worksheet"]
["Provider: ",null,null,null,null,null,null,null,null,null,"Date: "]
["Clinic and Location: "]
["Instructions: For each item below, please indicate the frequency with which you typically engage in the behavior described while providing behavioral health services in primary care. Please do not leave any question blank. Click on the answer box next to each question to open the drop down box. Select your answer based on the PPAQ Response Categories. \n"]
["PPAQ Response Categories: 1=Never  2=Rarely  3=Sometimes  4=Often  5=Always"]
["Question ",null,null,null,null,null,null,null,null,null,null,"Answer"]
[]
["1. During clinical encounters with patients, I see patients for 30 minutes or less."]
["2. I manage patients reporting mild and moderate symptoms in primary care, and I refer those with more severe symptoms to specialty mental health services when possible."]
{"$rows_left_out":47}
{"sheet":"PPAQ Follow-Up Scoring","index":6,"n_rows":63,"n_cols":13,"rows_kept":63,"cut":false,"hidden":false,"merged":[[17,1,17,3],[17,6,17,8],[0,0,0,1],[0,2,0,12],[1,0,1,12],[2,0,2,2],[2,3,2,9],[2,11,2,12],[3,0,3,2],[3,3,3,9],[4,0,4,12],[5,0,5,12],[8,11,9,12],[21,0,21,1],[21,2,21,5],[21,6,21,7],[21,8,23,12],[22,0,22,1],[22,2,22,5],[22,6,22,7],[23,0,23,1],[23,2,23,5],[23,6,23,7],[19,0,19,12],[20,0,20,1],[20,2,20,5],[20,6,20,7],[20,8,20,12],[24,8,26,12],[25,0,25,1],[25,2,25,5],[25,6,25,7],[26,0,26,1],[26,2,26,5],[26,6,26,7],[24,0,24,1],[24,2,24,5],[24,6,24,7],[27,0,27,1],[27,2,27,5],[27,6,27,7],[27,8,29,12],[28,0,28,1],[28,2,28,5],[28,6,28,7],[29,0,29,1],[29,2,29,5],[29,6,29,7],[33,0,33,1],[33,2,33,5],[33,6,33,7],[33,8,35,12],[34,0,34,1],[34,2,34,5],[34,6,34,7],[35,0,35,1],[35,2,35,5],[35,6,35,7],[31,0,31,12],[32,0,32,1],[32,2,32,5],[32,6,32,7],[32,8,32,12],[36,8,38,12],[37,0,37,1],[37,2,37,5],[37,6,37,7],[38,0,38,1],[38,2,38,5],[38,6,38,7],[36,0,36,1],[36,2,36,5],[36,6,36,7],[43,0,43,12],[62,0,62,12],[39,0,39,1],[39,2,39,5],[39,6,39,7],[39,8,41,12],[40,0,40,1],[40,2,40,5],[40,6,40,7],[41,0,41,1],[41,2,41,5],[41,6,41,7]]}
[null,null,"Primary Care Behavioral Health Provider Adherence Questionnaire (PPAQ) Toolkit"]
["Follow-Up Scoring and Interpretation Guide"]
["Provider: ",null,null,{"$f":"IF('PPAQ Follow Up'!D3:J3=\"\",\"\",'PPAQ Follow Up'!D3:J3)","v":""},null,null,null,null,null,null,"Date: ",{"$f":"IF('PPAQ Follow Up'!L3:M3=\"\",\"\",'PPAQ Follow Up'!L3:M3)","v":""}]
["Clinic and Location: ",null,null,{"$f":"IF('PPAQ Follow Up'!D4:J4=\"\",\"\",'PPAQ Follow Up'!D4:J4)","v":""}]
["Overview: The PPAQ items are summed to create two subscales.  The first subscale is for the PPAQ items that measure essential behaviors that are highly consistent with Primary Care Behavioral Health.  Higher scores on this subscale indicate higher fidelity.  The second subscale is for the PPAQ items that measure behaviors that are typically inconsistent with Primary Care Behavioral Health.  Higher scores on this subscale indicate lower fidelity.  "]
["Step 1: Your subscale scores are shown below:"]
["Item #","Value","Item #","Value","Item #","Value","Item #","Value","Item #","Value"]
[1,{"$f":"IF('PPAQ Follow Up'!L9=\"\",\"\",'PPAQ Follow Up'!L9)","v":""},11,{"$f":"IF('PPAQ Follow Up'!L19=\"\",\"\",'PPAQ Follow Up'!L19)","v":""},21,{"$f":"IF('PPAQ Follow Up'!L29=\"\",\"\",'PPAQ Follow Up'!L29)","v":""},31,{"$f":"IF('PPAQ Follow Up'!L39=\"\",\"\",'PPAQ Follow Up'!L39)","v":""},41,{"$f":"IF('PPAQ Follow Up'!L49=\"\",\"\",'PPAQ Follow Up'!L49)","v":""}]
[2,{"$f":"IF('PPAQ Follow Up'!L10=\"\",\"\",'PPAQ Follow Up'!L10)","v":""},12,{"$f":"IF('PPAQ Follow Up'!L20=\"\",\"\",'PPAQ Follow Up'!L20)","v":""},22,{"$f":"IF('PPAQ Follow Up'!L30=\"\",\"\",'PPAQ Follow Up'!L30)","v":""},32,{"$f":"IF('PPAQ Follow Up'!L40=\"\",\"\",'PPAQ Follow Up'!L40)","v":""},42,{"$f":"IF('PPAQ Follow Up'!L50=\"\",\"\",'PPAQ Follow Up'!L50)","v":""},null,"PPAQ Response Categories"]
[3,{"$f":"IF('PPAQ Follow Up'!L11=\"\",\"\",'PPAQ Follow Up'!L11)","v":""},13,{"$f":"IF('PPAQ Follow Up'!L21=\"\",\"\",'PPAQ Follow Up'!L21)","v":""},23,{"$f":"IF('PPAQ Follow Up'!L31=\"\",\"\",'PPAQ Follow Up'!L31)","v":""},33,{"$f":"IF('PPAQ Follow Up'!L41=\"\",\"\",'PPAQ Follow Up'!L41)","v":""},43,{"$f":"IF('PPAQ Follow Up'!L51=\"\",\"\",'PPAQ Follow Up'!L51)","v":""}]
{"$rows_left_out":54}
{"sheet":"PPAQ Score Comparison","index":7,"n_rows":63,"n_cols":18,"rows_kept":63,"cut":false,"hidden":false,"merged":[[23,0,23,2],[23,3,23,8],[23,12,23,14],[23,15,25,20],[24,0,24,2],[22,0,22,2],[22,3,22,8],[22,12,22,14],[22,15,22,20],[24,3,24,8],[24,12,24,14],[25,0,25,2],[25,3,25,8],[25,12,25,14],[26,15,28,20],[27,0,27,2],[27,3,27,8],[27,12,27,14],[28,0,28,2],[28,3,28,8],[28,12,28,14],[26,0,26,2],[26,3,26,8],[26,12,26,14],[26,9,26,11],[27,9,27,11],[28,9,28,11],[29,0,29,2],[29,3,29,8],[29,12,29,14],[29,15,31,20],[30,0,30,2],[30,3,30,8],[30,12,30,14],[31,0,31,2],[31,3,31,8],[31,12,31,14],[29,9,29,11],[30,9,30,11],[31,9,31,11],[34,0,34,2],[34,3,34,8],[34,12,34,14],[34,15,34,20],[33,0,33,20],[34,9,34,11],[35,0,35,2],[35,3,35,8],[35,12,35,14],[35,15,37,20],[36,0,36,2],[36,3,36,8],[36,12,36,14],[37,0,37,2],[37,3,37,8],[37,12,37,14],[35,9,35,11],[36,9,36,11],[37,9,37,11],[43,3,43,8],[43,12,43,14],[41,9,41,11],[42,9,42,11],[43,9,43,11],[48,18,48,20],[38,15,40,20],[39,0,39,2],[39,3,39,8],[39,12,39,14],[40,0,40,2],[40,3,40,8],[40,12,40,14],[38,0,38,2],[38,3,38,8],[38,12,38,14],[38,9,38,11],[39,9,39,11],[40,9,40,11],[0,3,0,20],[1,0,1,20],[2,16,2,20],[3,17,3,20],[4,0,4,20],[5,0,5,20],[17,17,17,20],[18,17,18,20],[19,17,19,20],[8,16,9,17],[17,9,19,12],[17,13,17,14],[18,13,18,14],[19,13,19,14],[0,0,0,2],[2,0,2,3],[2,5,2,14],[17,4,17,5],[18,4,18,5],[17,0,19,3],[19,4,19,5],[3,0,3,3],[3,5,3,14],[49,18,49,20],[50,18,50,20],[51,18,51,20],[52,18,52,20],[53,18,53,20],[20,0,20,20],[44,0,44,20],[45,0,45,20],[46,18,46,20],[47,18,47,20],[32,0,32,20],[21,0,21,20],[22,9,22,11],[23,9,23,11],[24,9,24,11],[25,9,25,11],[41,0,41,2],[41,3,41,8],[41,12,41,14],[41,15,43,20],[42,0,42,2],[42,3,42,8],[42,12,42,14],[43,0,43,2],[64,0,64,20],[59,18,59,20],[60,18,60,20],[61,18,61,20],[62,18,62,20],[63,0,63,20],[54,18,54,20],[55,18,55,20],[56,18,56,20],[57,18,57,20],[58,18,58,20]]}
[null,null,null,"Primary Care Behavioral Health Provider Adherence Questionnaire (PPAQ) Toolkit"]
["Comparing Your Scores"]
["Provider: ",null,null,null,null,null,null,null,null,null,null,null,null,null,null,"Date: "]
["Clinic and Location: "]
["Overview: The PPAQ items are summed to create two subscales.  The first subscale is for the PPAQ items that measure essential behaviors that are highly consistent with Primary Care Behavioral Health.  Higher scores on this subscale indicate higher fidelity.  The second subscale is for the PPAQ items that measure behaviors that are typically inconsistent with Primary Care Behavioral Health.  Higher scores on this subscale indicate lower fidelity. Here your current (follow-up) score is compared to your previous score to show how your performance on the PPAQ has changed since the last time you completed the toolkit. "]
["Step 1: Your subscale scores are shown below. Your change score reflects how your scores differ since the last time you completed the PPAQ."]
["Item #","Baseline","Follow-Up","Item #","Baseline","Follow-Up","Item #","Baseline","Follow-Up","Item #","Baseline","Follow-Up","Item #","Baseline","Follow-Up"]
[1,{"$f":"IF('PPAQ Baseline'!L9=\"\",\"\",'PPAQ Baseline'!L9)","v":""},{"$f":"IF('PPAQ Follow Up'!L9=\"\",\"\",'PPAQ Follow Up'!L9)","v":""},11,{"$f":"IF('PPAQ Baseline'!L19=\"\",\"\",'PPAQ Baseline'!L19)","v":""},{"$f":"IF('PPAQ Follow Up'!L19=\"\",\"\",'PPAQ Follow Up'!L19)","v":""},21,{"$f":"IF('PPAQ Baseline'!L29=\"\",\"\",'PPAQ Baseline'!L29)","v":""},{"$f":"IF('PPAQ Follow Up'!L29=\"\",\"\",'PPAQ Follow Up'!L29)","v":""},31,{"$f":"IF('PPAQ Baseline'!L39=\"\",\"\",'PPAQ Baseline'!L39)","v":""},{"$f":"IF('PPAQ Follow Up'!L39=\"\",\"\",'PPAQ Follow Up'!L39)","v":""},41,{"$f":"IF('PPAQ Baseline'!L49=\"\",\"\",'PPAQ Baseline'!L49)","v":""},{"$f":"IF('PPAQ Follow Up'!L49=\"\",\"\",'PPAQ Follow Up'!L49)","v":""}]
[2,{"$f":"IF('PPAQ Baseline'!L10=\"\",\"\",'PPAQ Baseline'!L10)","v":""},{"$f":"IF('PPAQ Follow Up'!L10=\"\",\"\",'PPAQ Follow Up'!L10)","v":""},12,{"$f":"IF('PPAQ Baseline'!L20=\"\",\"\",'PPAQ Baseline'!L20)","v":""},{"$f":"IF('PPAQ Follow Up'!L20=\"\",\"\",'PPAQ Follow Up'!L20)","v":""},22,{"$f":"IF('PPAQ Baseline'!L30=\"\",\"\",'PPAQ Baseline'!L30)","v":""},{"$f":"IF('PPAQ Follow Up'!L30=\"\",\"\",'PPAQ Follow Up'!L30)","v":""},32,{"$f":"IF('PPAQ Baseline'!L40=\"\",\"\",'PPAQ Baseline'!L40)","v":""},{"$f":"IF('PPAQ Follow Up'!L40=\"\",\"\",'PPAQ Follow Up'!L40)","v":""},42,{"$f":"IF('PPAQ Baseline'!L50=\"\",\"\",'PPAQ Baseline'!L50)","v":""},{"$f":"IF('PPAQ Follow Up'!L50=\"\",\"\",'PPAQ Follow Up'!L50)","v":""},null,"PPAQ Response Categories"]
[3,{"$f":"IF('PPAQ Baseline'!L11=\"\",\"\",'PPAQ Baseline'!L11)","v":""},{"$f":"IF('PPAQ Follow Up'!L11=\"\",\"\",'PPAQ Follow Up'!L11)","v":""},13,{"$f":"IF('PPAQ Baseline'!L21=\"\",\"\",'PPAQ Baseline'!L21)","v":""},{"$f":"IF('PPAQ Follow Up'!L21=\"\",\"\",'PPAQ Follow Up'!L21)","v":""},23,{"$f":"IF('PPAQ Baseline'!L31=\"\",\"\",'PPAQ Baseline'!L31)","v":""},{"$f":"IF('PPAQ Follow Up'!L31=\"\",\"\",'PPAQ Follow Up'!L31)","v":""},33,{"$f":"IF('PPAQ Baseline'!L41=\"\",\"\",'PPAQ Baseline'!L41)","v":""},{"$f":"IF('PPAQ Follow Up'!L41=\"\",\"\",'PPAQ Follow Up'!L41)","v":""},43,{"$f":"IF('PPAQ Baseline'!L51=\"\",\"\",'PPAQ Baseline'!L51)","v":""},{"$f":"IF('PPAQ Follow Up'!L51=\"\",\"\",'PPAQ Follow Up'!L51)","v":""}]
{"$rows_left_out":53}